Untitled
raw download clone
BASH
views 34
,
size 22180 b
============================================
PLATFORM_VERSION_CODENAME=REL
PLATFORM_VERSION=8.1.0
TARGET_PRODUCT=maru_j5y17lte
TARGET_BUILD_VARIANT=userdebug
TARGET_BUILD_TYPE=release
TARGET_ARCH=arm
TARGET_ARCH_VARIANT=armv7-a-neon
TARGET_CPU_VARIANT=cortex-a53
HOST_ARCH=x86_64
HOST_2ND_ARCH=x86
HOST_OS=linux
HOST_OS_EXTRA=Linux-5.4.0-28-generic-x86_64-with-Ubuntu-20.04-focal
HOST_CROSS_OS=windows
HOST_CROSS_ARCH=x86
HOST_CROSS_2ND_ARCH=x86_64
HOST_BUILD_TYPE=release
BUILD_ID=OPM7.181205.001
OUT_DIR=/media/pc2robin/023b0bd7-5b75-47c8-8d7b-3230a29c92bd/maru-0.6_build/working_dir/out
============================================
ninja: no work to do.
ninja: no work to do.
wildcard(/media/pc2robin/023b0bd7-5b75-47c8-8d7b-3230a29c92bd/maru-0.6_build/working_dir/out/target/product/j5y17lte/obj/KERNEL_OBJ/.headers_install_deps) was changed, regenerating...
[747/1082] including ./system/sepolicy/Android.mk ...
./system/sepolicy/Android.mk:99: warning: BOARD_SEPOLICY_VERS not specified, assuming current platform version
[1082/1082] including ./vendor/samsung/on7xelte/Android.mk ...
build/core/Makefile:34: warning: overriding commands for target `/media/pc2robin/023b0bd7-5b75-47c8-8d7b-3230a29c92bd/maru-0.6_build/working_dir/out/target/product/j5y17lte/system/vendor/etc/init/android.hardware.media.omx@1.0-service.rc'
build/core/base_rules.mk:405: warning: ignoring old commands for target `/media/pc2robin/023b0bd7-5b75-47c8-8d7b-3230a29c92bd/maru-0.6_build/working_dir/out/target/product/j5y17lte/system/vendor/etc/init/android.hardware.media.omx@1.0-service.rc'
build/core/Makefile:34: warning: overriding commands for target `/media/pc2robin/023b0bd7-5b75-47c8-8d7b-3230a29c92bd/maru-0.6_build/working_dir/out/target/product/j5y17lte/system/lib/hw/audio.primary.universal7870.so'
build/core/base_rules.mk:391: warning: ignoring old commands for target `/media/pc2robin/023b0bd7-5b75-47c8-8d7b-3230a29c92bd/maru-0.6_build/working_dir/out/target/product/j5y17lte/system/lib/hw/audio.primary.universal7870.so'
build/core/Makefile:34: warning: overriding commands for target `/media/pc2robin/023b0bd7-5b75-47c8-8d7b-3230a29c92bd/maru-0.6_build/working_dir/out/target/product/j5y17lte/system/lib/libaudioroute.so'
build/core/base_rules.mk:391: warning: ignoring old commands for target `/media/pc2robin/023b0bd7-5b75-47c8-8d7b-3230a29c92bd/maru-0.6_build/working_dir/out/target/product/j5y17lte/system/lib/libaudioroute.so'
build/core/Makefile:34: warning: overriding commands for target `/media/pc2robin/023b0bd7-5b75-47c8-8d7b-3230a29c92bd/maru-0.6_build/working_dir/out/target/product/j5y17lte/system/lib/libsecril-client.so'
build/core/base_rules.mk:391: warning: ignoring old commands for target `/media/pc2robin/023b0bd7-5b75-47c8-8d7b-3230a29c92bd/maru-0.6_build/working_dir/out/target/product/j5y17lte/system/lib/libsecril-client.so'
build/core/Makefile:34: warning: overriding commands for target `/media/pc2robin/023b0bd7-5b75-47c8-8d7b-3230a29c92bd/maru-0.6_build/working_dir/out/target/product/j5y17lte/system/lib/libsensorservice.so'
build/core/base_rules.mk:391: warning: ignoring old commands for target `/media/pc2robin/023b0bd7-5b75-47c8-8d7b-3230a29c92bd/maru-0.6_build/working_dir/out/target/product/j5y17lte/system/lib/libsensorservice.so'
build/core/Makefile:34: warning: overriding commands for target `/media/pc2robin/023b0bd7-5b75-47c8-8d7b-3230a29c92bd/maru-0.6_build/working_dir/out/target/product/j5y17lte/system/lib/libtinyalsa.so'
build/core/base_rules.mk:391: warning: ignoring old commands for target `/media/pc2robin/023b0bd7-5b75-47c8-8d7b-3230a29c92bd/maru-0.6_build/working_dir/out/target/product/j5y17lte/system/lib/libtinyalsa.so'
build/core/Makefile:34: warning: overriding commands for target `/media/pc2robin/023b0bd7-5b75-47c8-8d7b-3230a29c92bd/maru-0.6_build/working_dir/out/target/product/j5y17lte/system/vendor/lib/libbt-vendor.so'
build/core/base_rules.mk:391: warning: ignoring old commands for target `/media/pc2robin/023b0bd7-5b75-47c8-8d7b-3230a29c92bd/maru-0.6_build/working_dir/out/target/product/j5y17lte/system/vendor/lib/libbt-vendor.so'
build/core/Makefile:34: warning: overriding commands for target `/media/pc2robin/023b0bd7-5b75-47c8-8d7b-3230a29c92bd/maru-0.6_build/working_dir/out/target/product/j5y17lte/system/vendor/lib/mediadrm/libdrmclearkeyplugin.so'
build/core/base_rules.mk:391: warning: ignoring old commands for target `/media/pc2robin/023b0bd7-5b75-47c8-8d7b-3230a29c92bd/maru-0.6_build/working_dir/out/target/product/j5y17lte/system/vendor/lib/mediadrm/libdrmclearkeyplugin.so'
[  0% 14/64697] target thumb C: ebtables <= external/ebtables/extensions/ebt_among.c
external/ebtables/extensions/ebt_among.c:446:21: warning: use of logical '&&' with constant operand [-Wconstant-logical-operand]
                if (info->bitmask && EBT_AMONG_SRC_NEG) {
                                  ^  ~~~~~~~~~~~~~~~~~
external/ebtables/extensions/ebt_among.c:446:21: note: use '&' for a bitwise operation
                if (info->bitmask && EBT_AMONG_SRC_NEG) {
                                  ^~
                                  &
external/ebtables/extensions/ebt_among.c:446:21: note: remove constant to silence this warning
                if (info->bitmask && EBT_AMONG_SRC_NEG) {
                                 ~^~~~~~~~~~~~~~~~~~~~
1 warning generated.
[  0% 17/64697] Ensuring Jack server is installed and started
Jack server already installed in "/home/pc2robin/.jack-server"
Server is already running
[  0% 26/64697] target thumb C: ebtables <= external/ebtables/useful_functions.c
external/ebtables/useful_functions.c:59:27: warning: incompatible pointer types passing 'struct ether_addr *' to parameter of type 'const struct ether_addr *' [-Wincompatible-pointer-types]
                printf("%s", ether_ntoa((struct ether_addr *) mac));
                                        ^~~~~~~~~~~~~~~~~~~~~~~~~
bionic/libc/include/netinet/ether.h:37:42: note: passing argument to parameter here
char* ether_ntoa(const struct ether_addr*) __INTRODUCED_IN(11);
                                         ^
1 warning generated.
[  0% 37/64697] target thumb C: ebtables <= external/ebtables/libebtc.c
external/ebtables/libebtc.c:45:21: warning: use of GNU 'missing =' extension in designator [-Wgnu-designator]
        [NF_BR_PRE_ROUTING]"PREROUTING",
                           ^
                           = 
external/ebtables/libebtc.c:46:18: warning: use of GNU 'missing =' extension in designator [-Wgnu-designator]
        [NF_BR_LOCAL_IN]"INPUT",
                        ^
                        = 
external/ebtables/libebtc.c:47:17: warning: use of GNU 'missing =' extension in designator [-Wgnu-designator]
        [NF_BR_FORWARD]"FORWARD",
                       ^
                       = 
external/ebtables/libebtc.c:48:19: warning: use of GNU 'missing =' extension in designator [-Wgnu-designator]
        [NF_BR_LOCAL_OUT]"OUTPUT",
                         ^
                         = 
external/ebtables/libebtc.c:49:22: warning: use of GNU 'missing =' extension in designator [-Wgnu-designator]
        [NF_BR_POST_ROUTING]"POSTROUTING",
                            ^
                            = 
external/ebtables/libebtc.c:50:18: warning: use of GNU 'missing =' extension in designator [-Wgnu-designator]
        [NF_BR_BROUTING]"BROUTING"
                        ^
                        = 
6 warnings generated.
[  0% 46/64697] target thumb C: ebtables <= external/ebtables/communication.c
external/ebtables/communication.c:498:3: warning: arithmetic on a pointer to void is a GNU extension [-Wpointer-arith]
                EBT_MATCH_ITERATE(e, ebt_translate_match, &m_l);
                ^~~~~~~~~~~~~~~~~~~~~~~~~~~~~~~~~~~~~~~~~~~~~~~
/media/pc2robin/023b0bd7-5b75-47c8-8d7b-3230a29c92bd/maru-0.6_build/working_dir/out/target/product/j5y17lte/obj/KERNEL_OBJ/usr/include/linux/netfilter_bridge/ebtables.h:209:25: note: expanded from macro 'EBT_MATCH_ITERATE'
                __match = (void *)(e) + __i;                \
                          ~~~~~~~~~~~ ^
external/ebtables/communication.c:500:3: warning: arithmetic on a pointer to void is a GNU extension [-Wpointer-arith]
                EBT_WATCHER_ITERATE(e, ebt_translate_watcher, &w_l);
                ^~~~~~~~~~~~~~~~~~~~~~~~~~~~~~~~~~~~~~~~~~~~~~~~~~~
/media/pc2robin/023b0bd7-5b75-47c8-8d7b-3230a29c92bd/maru-0.6_build/working_dir/out/target/product/j5y17lte/obj/KERNEL_OBJ/usr/include/linux/netfilter_bridge/ebtables.h:232:27: note: expanded from macro 'EBT_WATCHER_ITERATE'
                __watcher = (void *)(e) + __i;              \
                            ~~~~~~~~~~~ ^
external/ebtables/communication.c:754:2: warning: arithmetic on a pointer to void is a GNU extension [-Wpointer-arith]
        EBT_ENTRY_ITERATE(repl.entries, repl.entries_size, ebt_translate_chains,
        ^~~~~~~~~~~~~~~~~~~~~~~~~~~~~~~~~~~~~~~~~~~~~~~~~~~~~~~~~~~~~~~~~~~~~~~~
/media/pc2robin/023b0bd7-5b75-47c8-8d7b-3230a29c92bd/maru-0.6_build/working_dir/out/target/product/j5y17lte/obj/KERNEL_OBJ/usr/include/linux/netfilter_bridge/ebtables.h:252:31: note: expanded from macro 'EBT_ENTRY_ITERATE'
                __entry = (void *)(entries) + __i;          \
                          ~~~~~~~~~~~~~~~~~ ^
external/ebtables/communication.c:765:2: warning: arithmetic on a pointer to void is a GNU extension [-Wpointer-arith]
        EBT_ENTRY_ITERATE((char *)repl.entries, repl.entries_size,
        ^~~~~~~~~~~~~~~~~~~~~~~~~~~~~~~~~~~~~~~~~~~~~~~~~~~~~~~~~~
/media/pc2robin/023b0bd7-5b75-47c8-8d7b-3230a29c92bd/maru-0.6_build/working_dir/out/target/product/j5y17lte/obj/KERNEL_OBJ/usr/include/linux/netfilter_bridge/ebtables.h:252:31: note: expanded from macro 'EBT_ENTRY_ITERATE'
                __entry = (void *)(entries) + __i;          \
                          ~~~~~~~~~~~~~~~~~ ^
4 warnings generated.
[  0% 146/64697] target thumb C++: libwifi-hal-bcm <= hardware/broadcom/wlan/bcmdhd/wifi_hal/rtt.cpp
hardware/broadcom/wlan/bcmdhd/wifi_hal/rtt.cpp:221:13: warning: field 'm_max_duration_sec' will be initialized after field 'mResponderInfo' [-Wreorder]
            m_max_duration_sec(max_duration_seconds), mResponderInfo(responderInfo)
            ^
1 warning generated.
[  0% 303/64697] target thumb C: libbt-vendor <= hardware/broadcom/libbt/src/bt_vendor_brcm.c
hardware/broadcom/libbt/src/bt_vendor_brcm.c:149:12: warning: enumeration values 'BT_VND_OP_A2DP_OFFLOAD_START' and 'BT_VND_OP_A2DP_OFFLOAD_STOP' not handled in switch [-Wswitch]
    switch(opcode)
           ^
1 warning generated.
[  0% 306/64697] target thumb C: libbt-vendor <= hardware/broadcom/libbt/src/userial_vendor.c
hardware/broadcom/libbt/src/userial_vendor.c:337:63: warning: unused parameter 'p_data' [-Wunused-parameter]
void userial_vendor_ioctl(userial_vendor_ioctl_op_t op, void *p_data)
                                                              ^
hardware/broadcom/libbt/src/userial_vendor.c:372:28: warning: unused parameter 'p_conf_name' [-Wunused-parameter]
int userial_set_port(char *p_conf_name, char *p_conf_value, int param)
                           ^
hardware/broadcom/libbt/src/userial_vendor.c:372:65: warning: unused parameter 'param' [-Wunused-parameter]
int userial_set_port(char *p_conf_name, char *p_conf_value, int param)
                                                                ^
hardware/broadcom/libbt/src/userial_vendor.c:389:45: warning: unused parameter 'p_conf_name' [-Wunused-parameter]
int userial_set_force_use_2_stop_bits(char *p_conf_name, char *p_conf_value, int param)
                                            ^
hardware/broadcom/libbt/src/userial_vendor.c:389:82: warning: unused parameter 'param' [-Wunused-parameter]
int userial_set_force_use_2_stop_bits(char *p_conf_name, char *p_conf_value, int param)
                                                                                 ^
5 warnings generated.
[  0% 309/64697] target thumb C: libbt-vendor <= hardware/broadcom/libbt/src/upio.c
hardware/broadcom/libbt/src/upio.c:363:52: warning: unused parameter 'polarity' [-Wunused-parameter]
void upio_set(uint8_t pio, uint8_t action, uint8_t polarity)
                                                   ^
1 warning generated.
[  0% 317/64697] target thumb C: libbt-vendor <= hardware/broadcom/libbt/src/hardware.c
hardware/broadcom/libbt/src/hardware.c:1742:34: warning: unused parameter 'p_conf_name' [-Wunused-parameter]
int hw_set_patch_file_path(char *p_conf_name, char *p_conf_value, int param)
                                 ^
hardware/broadcom/libbt/src/hardware.c:1742:71: warning: unused parameter 'param' [-Wunused-parameter]
int hw_set_patch_file_path(char *p_conf_name, char *p_conf_value, int param)
                                                                      ^
hardware/broadcom/libbt/src/hardware.c:1760:34: warning: unused parameter 'p_conf_name' [-Wunused-parameter]
int hw_set_patch_file_name(char *p_conf_name, char *p_conf_value, int param)
                                 ^
hardware/broadcom/libbt/src/hardware.c:1760:71: warning: unused parameter 'param' [-Wunused-parameter]
int hw_set_patch_file_name(char *p_conf_name, char *p_conf_value, int param)
                                                                      ^
hardware/broadcom/libbt/src/hardware.c:1778:38: warning: unused parameter 'p_conf_name' [-Wunused-parameter]
int hw_set_pre_patch_file_name(char *p_conf_name, char *p_conf_value, int param)
                                     ^
hardware/broadcom/libbt/src/hardware.c:1778:75: warning: unused parameter 'param' [-Wunused-parameter]
int hw_set_pre_patch_file_name(char *p_conf_name, char *p_conf_value, int param)
                                                                          ^
6 warnings generated.
[  0% 360/64697] Building Kernel Config
make : on entre dans le répertoire « /media/pc2robin/023b0bd7-5b75-47c8-8d7b-3230a29c92bd/maru-0.6_build/working_dir/kernel/samsung/exynos7870 »
make[1] : on entre dans le répertoire « /media/pc2robin/023b0bd7-5b75-47c8-8d7b-3230a29c92bd/maru-0.6_build/working_dir/out/target/product/j5y17lte/obj/KERNEL_OBJ »
  GEN     ./Makefile
drivers/media/mtv/sms3230/Kconfig:51:warning: ignoring type redefinition of 'SMS_USB_DRV' from 'tristate' to 'boolean'
drivers/media/mtv/sms3230/Kconfig:58:warning: ignoring type redefinition of 'SMS_SDIO_DRV' from 'tristate' to 'boolean'
drivers/battery_v2/Kconfig:75:warning: ignoring type redefinition of 'BATTERY_AGE_FORECAST' from 'tristate' to 'boolean'
#
# configuration written to .config
#
make[1] : on quitte le répertoire « /media/pc2robin/023b0bd7-5b75-47c8-8d7b-3230a29c92bd/maru-0.6_build/working_dir/out/target/product/j5y17lte/obj/KERNEL_OBJ »
make : on quitte le répertoire « /media/pc2robin/023b0bd7-5b75-47c8-8d7b-3230a29c92bd/maru-0.6_build/working_dir/kernel/samsung/exynos7870 »
make : on entre dans le répertoire « /media/pc2robin/023b0bd7-5b75-47c8-8d7b-3230a29c92bd/maru-0.6_build/working_dir/kernel/samsung/exynos7870 »
make[1] : on entre dans le répertoire « /media/pc2robin/023b0bd7-5b75-47c8-8d7b-3230a29c92bd/maru-0.6_build/working_dir/out/target/product/j5y17lte/obj/KERNEL_OBJ »
  GEN     ./Makefile
scripts/kconfig/conf --savedefconfig=defconfig Kconfig
drivers/media/mtv/sms3230/Kconfig:51:warning: ignoring type redefinition of 'SMS_USB_DRV' from 'tristate' to 'boolean'
drivers/media/mtv/sms3230/Kconfig:58:warning: ignoring type redefinition of 'SMS_SDIO_DRV' from 'tristate' to 'boolean'
drivers/battery_v2/Kconfig:75:warning: ignoring type redefinition of 'BATTERY_AGE_FORECAST' from 'tristate' to 'boolean'
make[1] : on quitte le répertoire « /media/pc2robin/023b0bd7-5b75-47c8-8d7b-3230a29c92bd/maru-0.6_build/working_dir/out/target/product/j5y17lte/obj/KERNEL_OBJ »
make : on quitte le répertoire « /media/pc2robin/023b0bd7-5b75-47c8-8d7b-3230a29c92bd/maru-0.6_build/working_dir/kernel/samsung/exynos7870 »
[  0% 510/64697] Building Kernel
FAILED: TARGET_KERNEL_BINARIES 
/bin/bash -c "(rm -rf /media/pc2robin/023b0bd7-5b75-47c8-8d7b-3230a29c92bd/maru-0.6_build/working_dir/out/target/product/j5y17lte/system/vendor/lib/modules ) && (mkdir -p /media/pc2robin/023b0bd7-5b75-47c8-8d7b-3230a29c92bd/maru-0.6_build/working_dir/out/target/product/j5y17lte/system/vendor/lib/modules ) && (rm -rf /media/pc2robin/023b0bd7-5b75-47c8-8d7b-3230a29c92bd/maru-0.6_build/working_dir/out/target/product/j5y17lte/obj/PACKAGING/depmod_vendor_intermediates ) && (make -j12  CFLAGS_MODULE=\"-fno-pic\" -C kernel/samsung/exynos7870 O=/media/pc2robin/023b0bd7-5b75-47c8-8d7b-3230a29c92bd/maru-0.6_build/working_dir/out/target/product/j5y17lte/obj/KERNEL_OBJ ARCH=arm64 CROSS_COMPILE=\" /media/pc2robin/023b0bd7-5b75-47c8-8d7b-3230a29c92bd/maru-0.6_build/working_dir/prebuilts/gcc/linux-x86/aarch64/aarch64-linux-android-4.9/bin/aarch64-linux-android-\"   Image.gz-dtb ) && (if grep -q '^CONFIG_OF=y' /media/pc2robin/023b0bd7-5b75-47c8-8d7b-3230a29c92bd/maru-0.6_build/working_dir/out/target/product/j5y17lte/obj/KERNEL_OBJ/.config; then 	echo \"Building DTBs\"; 			make -j12  CFLAGS_MODULE=\"-fno-pic\" -C kernel/samsung/exynos7870 O=/media/pc2robin/023b0bd7-5b75-47c8-8d7b-3230a29c92bd/maru-0.6_build/working_dir/out/target/product/j5y17lte/obj/KERNEL_OBJ ARCH=arm64 CROSS_COMPILE=\" /media/pc2robin/023b0bd7-5b75-47c8-8d7b-3230a29c92bd/maru-0.6_build/working_dir/prebuilts/gcc/linux-x86/aarch64/aarch64-linux-android-4.9/bin/aarch64-linux-android-\"   dtbs; 		fi ) && (if grep -q '^CONFIG_MODULES=y' /media/pc2robin/023b0bd7-5b75-47c8-8d7b-3230a29c92bd/maru-0.6_build/working_dir/out/target/product/j5y17lte/obj/KERNEL_OBJ/.config; then 			echo \"Building Kernel Modules\"; 			make -j12  CFLAGS_MODULE=\"-fno-pic\" -C kernel/samsung/exynos7870 O=/media/pc2robin/023b0bd7-5b75-47c8-8d7b-3230a29c92bd/maru-0.6_build/working_dir/out/target/product/j5y17lte/obj/KERNEL_OBJ ARCH=arm64 CROSS_COMPILE=\" /media/pc2robin/023b0bd7-5b75-47c8-8d7b-3230a29c92bd/maru-0.6_build/working_dir/prebuilts/gcc/linux-x86/aarch64/aarch64-linux-android-4.9/bin/aarch64-linux-android-\"   modules; 		fi )"
make : on entre dans le répertoire « /media/pc2robin/023b0bd7-5b75-47c8-8d7b-3230a29c92bd/maru-0.6_build/working_dir/kernel/samsung/exynos7870 »
make[1] : on entre dans le répertoire « /media/pc2robin/023b0bd7-5b75-47c8-8d7b-3230a29c92bd/maru-0.6_build/working_dir/out/target/product/j5y17lte/obj/KERNEL_OBJ »
  GEN     ./Makefile
scripts/kconfig/conf --silentoldconfig Kconfig
drivers/media/mtv/sms3230/Kconfig:51:warning: ignoring type redefinition of 'SMS_USB_DRV' from 'tristate' to 'boolean'
drivers/media/mtv/sms3230/Kconfig:58:warning: ignoring type redefinition of 'SMS_SDIO_DRV' from 'tristate' to 'boolean'
drivers/battery_v2/Kconfig:75:warning: ignoring type redefinition of 'BATTERY_AGE_FORECAST' from 'tristate' to 'boolean'
INFO: CC is /media/pc2robin/023b0bd7-5b75-47c8-8d7b-3230a29c92bd/maru-0.6_build/working_dir/prebuilts/gcc/linux-x86/aarch64/aarch64-linux-android-4.9/bin/aarch64-linux-android-gcc
  CHK     include/config/kernel.release
  GEN     ./Makefile
  CHK     include/generated/uapi/linux/version.h
  UPD     include/config/kernel.release
  HOSTCC  scripts/kallsyms
  HOSTCC  scripts/sortextable
  HOSTCC  scripts/dtc/flattree.o
  HOSTCC  scripts/dtc/dtc.o
  HOSTCC  scripts/dtc/fstree.o
  HOSTCC  scripts/dtc/data.o
  HOSTCC  scripts/dtc/livetree.o
  HOSTCC  scripts/dtc/treesource.o
  HOSTCC  scripts/genksyms/genksyms.o
  HOSTCC  scripts/dtc/srcpos.o
  CC      scripts/mod/empty.o
  HOSTCC  scripts/selinux/genheaders/genheaders
  HOSTCC  scripts/mod/mk_elfconfig
  HOSTCC  scripts/dtc/checks.o
  CC      scripts/mod/devicetable-offsets.s
  HOSTCC  scripts/dtc/util.o
  HOSTCC  scripts/selinux/mdp/mdp
  HOSTCC  scripts/dtc/dtc-lexer.lex.o
In file included from /media/pc2robin/023b0bd7-5b75-47c8-8d7b-3230a29c92bd/maru-0.6_build/working_dir/kernel/samsung/exynos7870/include/linux/types.h:5:0,
                 from /media/pc2robin/023b0bd7-5b75-47c8-8d7b-3230a29c92bd/maru-0.6_build/working_dir/kernel/samsung/exynos7870/include/linux/mod_devicetable.h:11,
                 from /media/pc2robin/023b0bd7-5b75-47c8-8d7b-3230a29c92bd/maru-0.6_build/working_dir/kernel/samsung/exynos7870/scripts/mod/devicetable-offsets.c:2:
/media/pc2robin/023b0bd7-5b75-47c8-8d7b-3230a29c92bd/maru-0.6_build/working_dir/kernel/samsung/exynos7870/include/uapi/linux/types.h:4:23: fatal error: asm/types.h: No such file or directory
 #include <asm/types.h>
                       ^
compilation terminated.
make[3]: *** [/media/pc2robin/023b0bd7-5b75-47c8-8d7b-3230a29c92bd/maru-0.6_build/working_dir/kernel/samsung/exynos7870/scripts/Makefile.build:153: scripts/mod/devicetable-offsets.s] Error 1
make[3]: *** Attente des tâches non terminées....
make[2]: *** [/media/pc2robin/023b0bd7-5b75-47c8-8d7b-3230a29c92bd/maru-0.6_build/working_dir/kernel/samsung/exynos7870/scripts/Makefile.build:402: scripts/mod] Error 2
make[2]: *** Attente des tâches non terminées....
  HOSTCC  scripts/genksyms/parse.tab.o
  HOSTCC  scripts/dtc/dtc-parser.tab.o
  HOSTCC  scripts/genksyms/lex.lex.o
  HOSTLD  scripts/dtc/dtc
  HOSTLD  scripts/genksyms/genksyms
make[1]: *** [/media/pc2robin/023b0bd7-5b75-47c8-8d7b-3230a29c92bd/maru-0.6_build/working_dir/kernel/samsung/exynos7870/Makefile:583: scripts] Error 2
make[1] : on quitte le répertoire « /media/pc2robin/023b0bd7-5b75-47c8-8d7b-3230a29c92bd/maru-0.6_build/working_dir/out/target/product/j5y17lte/obj/KERNEL_OBJ »
make: *** [Makefile:145: sub-make] Error 2
make : on quitte le répertoire « /media/pc2robin/023b0bd7-5b75-47c8-8d7b-3230a29c92bd/maru-0.6_build/working_dir/kernel/samsung/exynos7870 »
[  0% 521/64697] target arm C++: libwebrtc_system_wrappers <= external/webrtc/webrtc/system_wrappers/source/sort.cc
ninja: build stopped: subcommand failed.
12:04:30 ninja failed with: exit status 1

#### failed to build some targets (40 seconds) ####
close fullscreen
Login or Register to edit or fork this paste. It's free.