Untitled
raw download clone
TEXT
views 62
,
size 53720 b
:\Users\cycub\Documents\cybercube-am\cybercube>mvn clean install
Picked up JAVA_TOOL_OPTIONS: -Dfile.encoding=UTF8
[INFO] Scanning for projects...
[WARNING]
[WARNING] Some problems were encountered while building the effective model for com.cybercube:cat-analytical-engine:jar:1.1.0
[WARNING] 'dependencies.dependency.(groupId:artifactId:type:classifier)' must be unique: com.h2database:h2:jar -> version (?) vs 1.4.199 @ line 223, column 21
[WARNING]
[WARNING] Some problems were encountered while building the effective model for com.cybercube:risk-score-engine:jar:1.0.0
[WARNING] 'dependencies.dependency.(groupId:artifactId:type:classifier)' must be unique: org.projectlombok:lombok:jar -> version 1.18.10 vs 1.18.6 @ line 175, column 21
[WARNING] 'build.plugins.plugin.version' for org.apache.maven.plugins:maven-compiler-plugin is missing. @ line 27, column 21
[WARNING]
[WARNING] Some problems were encountered while building the effective model for com.cybercube:user-service:jar:1.0.0
[WARNING] 'build.plugins.plugin.version' for org.apache.maven.plugins:maven-compiler-plugin is missing. @ line 63, column 21
[WARNING]
[WARNING] Some problems were encountered while building the effective model for com.cybercube:solr:jar:1.5.0
[WARNING] 'build.plugins.plugin.version' for org.apache.maven.plugins:maven-jar-plugin is missing. @ line 17, column 21
[WARNING]
[WARNING] It is highly recommended to fix these problems because they threaten the stability of your build.
[WARNING]
[WARNING] For this reason, future Maven versions might no longer support building such malformed projects.
[WARNING]
[INFO] ------------------------------------------------------------------------
[INFO] Reactor Build Order:
[INFO]
[INFO] cybercube                                                          [pom]
[INFO] cat-analytical-engine                                              [jar]
[INFO] risk-score-engine                                                  [jar]
[INFO] user-service                                                       [jar]
[INFO] client-web                                                         [war]
[INFO] Aggregate Report                                                   [jar]
[INFO] solr                                                               [jar]
[INFO]
[INFO] ----------------------< com.cybercube:cybercube >-----------------------
[INFO] Building cybercube 1.14.0                                          [1/7]
[INFO] --------------------------------[ pom ]---------------------------------
[INFO]
[INFO] --- maven-clean-plugin:2.5:clean (default-clean) @ cybercube ---
[INFO]
[INFO] --- jacoco-maven-plugin:0.8.3:prepare-agent (prepare-agent) @ cybercube ---
[INFO] argLine set to -javaagent:C:\\Users\\cycub\\.m2\\repository\\org\\jacoco\\org.jacoco.agent\\0.8.3\\org.jacoco.agent-0.8.3-runtime.jar=destfile=C:\\Users\\cycub\\Documents\\cybercube-am\\cybercube\\target\\jacoco.exec
[INFO]
[INFO] --- maven-install-plugin:2.4:install (default-install) @ cybercube ---
[INFO] Installing C:\Users\cycub\Documents\cybercube-am\cybercube\pom.xml to C:\Users\cycub\.m2\repository\com\cybercube\cybercube\1.14.0\cybercube-1.14.0.pom
[INFO]
[INFO] ----------------< com.cybercube:cat-analytical-engine >-----------------
[INFO] Building cat-analytical-engine 1.1.0                               [2/7]
[INFO] --------------------------------[ jar ]---------------------------------
[INFO]
[INFO] --- maven-clean-plugin:2.5:clean (default-clean) @ cat-analytical-engine ---
[INFO] Deleting C:\Users\cycub\Documents\cybercube-am\cybercube\cat-analytical-engine\target
[INFO]
[INFO] --- jacoco-maven-plugin:0.8.1:prepare-agent (prepare-agent) @ cat-analytical-engine ---
[INFO] argLine set to -javaagent:C:\\Users\\cycub\\.m2\\repository\\org\\jacoco\\org.jacoco.agent\\0.8.1\\org.jacoco.agent-0.8.1-runtime.jar=destfile=C:\\Users\\cycub\\Documents\\cybercube-am\\cybercube\\cat-analytical-engine\\targe
t\\jacoco.exec
[INFO]
[INFO] --- maven-resources-plugin:3.1.0:resources (default-resources) @ cat-analytical-engine ---
[WARNING] Using platform encoding (UTF8 actually) to copy filtered resources, i.e. build is platform dependent!
[INFO] Copying 4 resources
[INFO]
[INFO] --- maven-compiler-plugin:3.8.0:compile (default-compile) @ cat-analytical-engine ---
[INFO] Changes detected - recompiling the module!
[WARNING] File encoding has not been set, using platform encoding UTF8, i.e. build is platform dependent!
[INFO] Compiling 145 source files to C:\Users\cycub\Documents\cybercube-am\cybercube\cat-analytical-engine\target\classes
[WARNING] /C:/Users/cycub/Documents/cybercube-am/cybercube/cat-analytical-engine/src/main/java/com/cybercube/cat/service/CatRunJobService.java:[15,52] com.sun.org.apache.xpath.internal.operations.Bool is internal proprietary API and
 may be removed in a future release
[WARNING] /C:/Users/cycub/Documents/cybercube-am/cybercube/cat-analytical-engine/src/main/java/com/cybercube/cat/service/CatRunJobService.java:[15,52] com.sun.org.apache.xpath.internal.operations.Bool is internal proprietary API and
 may be removed in a future release
[WARNING] /C:/Users/cycub/Documents/cybercube-am/cybercube/cat-analytical-engine/src/main/java/com/cybercube/cat/service/CatRunJobService.java:[15,52] com.sun.org.apache.xpath.internal.operations.Bool is internal proprietary API and
 may be removed in a future release
[WARNING] /C:/Users/cycub/Documents/cybercube-am/cybercube/cat-analytical-engine/src/main/java/com/cybercube/cat/service/CatRunJobService.java:[15,52] com.sun.org.apache.xpath.internal.operations.Bool is internal proprietary API and
 may be removed in a future release
[WARNING] /C:/Users/cycub/Documents/cybercube-am/cybercube/cat-analytical-engine/src/main/java/com/cybercube/cat/service/CatRunJobService.java:[15,52] com.sun.org.apache.xpath.internal.operations.Bool is internal proprietary API and
 may be removed in a future release
[INFO] /C:/Users/cycub/Documents/cybercube-am/cybercube/cat-analytical-engine/src/main/java/com/cybercube/cat/service/CatRunJobService.java: Some input files use or override a deprecated API.
[INFO] /C:/Users/cycub/Documents/cybercube-am/cybercube/cat-analytical-engine/src/main/java/com/cybercube/cat/service/CatRunJobService.java: Recompile with -Xlint:deprecation for details.
[INFO] /C:/Users/cycub/Documents/cybercube-am/cybercube/cat-analytical-engine/src/main/java/com/cybercube/cat/simulation/SimUtils.java: Some input files use unchecked or unsafe operations.
[INFO] /C:/Users/cycub/Documents/cybercube-am/cybercube/cat-analytical-engine/src/main/java/com/cybercube/cat/simulation/SimUtils.java: Recompile with -Xlint:unchecked for details.
[INFO]
[INFO] --- aspectj-maven-plugin:1.8:compile (default) @ cat-analytical-engine ---
[INFO] Showing AJC message detail for messages of types: [error, warning, fail]
[WARNING] couldn't find aspectjrt.jar on classpath, checked: C:\Program Files\Java\jdk1.8.0_221\jre\lib\resources.jar;C:\Program Files\Java\jdk1.8.0_221\jre\lib\rt.jar;C:\Program Files\Java\jdk1.8.0_221\jre\lib\sunrsasign.jar;C:\Pro
gram Files\Java\jdk1.8.0_221\jre\lib\jsse.jar;C:\Program Files\Java\jdk1.8.0_221\jre\lib\jce.jar;C:\Program Files\Java\jdk1.8.0_221\jre\lib\charsets.jar;C:\Program Files\Java\jdk1.8.0_221\jre\lib\jfr.jar;C:\Program Files\Java\jdk1.8
.0_221\jre\classes;C:\Users\cycub\.m2\repository\org\springframework\spring-aspects\5.1.6.RELEASE\spring-aspects-5.1.6.RELEASE.jar;C:\Program Files\Java\jdk1.8.0_221\jre\lib\ext\access-bridge-64.jar;C:\Program Files\Java\jdk1.8.0_22
1\jre\lib\ext\cldrdata.jar;C:\Program Files\Java\jdk1.8.0_221\jre\lib\ext\dnsns.jar;C:\Program Files\Java\jdk1.8.0_221\jre\lib\ext\jaccess.jar;C:\Program Files\Java\jdk1.8.0_221\jre\lib\ext\jfxrt.jar;C:\Program Files\Java\jdk1.8.0_2
21\jre\lib\ext\localedata.jar;C:\Program Files\Java\jdk1.8.0_221\jre\lib\ext\nashorn.jar;C:\Program Files\Java\jdk1.8.0_221\jre\lib\ext\sunec.jar;C:\Program Files\Java\jdk1.8.0_221\jre\lib\ext\sunjce_provider.jar;C:\Program Files\Ja
va\jdk1.8.0_221\jre\lib\ext\sunmscapi.jar;C:\Program Files\Java\jdk1.8.0_221\jre\lib\ext\sunpkcs11.jar;C:\Program Files\Java\jdk1.8.0_221\jre\lib\ext\zipfs.jar;C:\Users\cycub\.m2\repository\org\elasticsearch\elasticsearch\7.1.1\elas
ticsearch-7.1.1.jar;C:\Users\cycub\.m2\repository\org\elasticsearch\client\elasticsearch-rest-high-level-client\7.1.1\elasticsearch-rest-high-level-client-7.1.1.jar;C:\Users\cycub\.m2\repository\mysql\mysql-connector-java\8.0.13\mys
ql-connector-java-8.0.13.jar;C:\Users\cycub\.m2\repository\org\slf4j\slf4j-api\1.7.25\slf4j-api-1.7.25.jar;C:\Users\cycub\.m2\repository\org\apache\commons\commons-math3\3.6.1\commons-math3-3.6.1.jar;C:\Users\cycub\.m2\repository\or
g\apache\commons\commons-lang3\3.8.1\commons-lang3-3.8.1.jar;C:\Users\cycub\.m2\repository\com\googlecode\json-simple\json-simple\1.1.1\json-simple-1.1.1.jar;C:\Users\cycub\.m2\repository\com\amazonaws\aws-java-sdk-core\1.11.126\aws
-java-sdk-core-1.11.126.jar;C:\Users\cycub\.m2\repository\com\amazonaws\aws-java-sdk-sqs\1.11.126\aws-java-sdk-sqs-1.11.126.jar;C:\Users\cycub\.m2\repository\com\amazonaws\aws-java-sdk-s3\1.11.126\aws-java-sdk-s3-1.11.126.jar;C:\Use
rs\cycub\.m2\repository\com\amazonaws\aws-java-sdk-autoscaling\1.11.126\aws-java-sdk-autoscaling-1.11.126.jar;C:\Users\cycub\.m2\repository\commons-io\commons-io\2.5\commons-io-2.5.jar;C:\Users\cycub\.m2\repository\org\apache\mahout
\mahout-math\0.13.0\mahout-math-0.13.0.jar;C:\Users\cycub\.m2\repository\org\springframework\spring-context\5.1.6.RELEASE\spring-context-5.1.6.RELEASE.jar;C:\Users\cycub\.m2\repository\javax\validation\validation-api\2.0.1.Final\val
idation-api-2.0.1.Final.jar;C:\Users\cycub\.m2\repository\org\glassfish\javax.el\3.0.1-b08\javax.el-3.0.1-b08.jar;C:\Users\cycub\.m2\repository\c3p0\c3p0\0.9.1.2\c3p0-0.9.1.2.jar;C:\Users\cycub\.m2\repository\org\springframework\spr
ing-aspects\5.1.6.RELEASE\spring-aspects-5.1.6.RELEASE.jar;C:\Users\cycub\.m2\repository\org\springframework\spring-jdbc\5.1.6.RELEASE\spring-jdbc-5.1.6.RELEASE.jar;C:\Users\cycub\.m2\repository\org\springframework\spring-test\5.1.6
.RELEASE\spring-test-5.1.6.RELEASE.jar;C:\Users\cycub\.m2\repository\org\eclipse\jdt\core\compiler\ecj\4.6.1\ecj-4.6.1.jar;C:\Users\cycub\.m2\repository\org\hibernate\hibernate-validator\5.4.3.Final\hibernate-validator-5.4.3.Final.j
ar;C:\Users\cycub\.m2\repository\org\jmockit\jmockit\1.8\jmockit-1.8.jar;C:\Users\cycub\.m2\repository\org\junit\jupiter\junit-jupiter-api\5.4.2\junit-jupiter-api-5.4.2.jar;C:\Users\cycub\.m2\repository\org\junit\jupiter\junit-jupit
er-engine\5.4.2\junit-jupiter-engine-5.4.2.jar;C:\Users\cycub\.m2\repository\org\junit\platform\junit-platform-suite-api\1.3.1\junit-platform-suite-api-1.3.1.jar;C:\Users\cycub\.m2\repository\org\apache\logging\log4j\log4j-api\2.6.1
\log4j-api-2.6.1.jar;C:\Users\cycub\.m2\repository\org\apache\logging\log4j\log4j-core\2.6.1\log4j-core-2.6.1.jar;C:\Users\cycub\.m2\repository\com\lmax\disruptor\3.3.4\disruptor-3.3.4.jar;C:\Users\cycub\.m2\repository\org\slf4j\jcl
-over-slf4j\1.7.25\jcl-over-slf4j-1.7.25.jar;C:\Users\cycub\.m2\repository\org\slf4j\log4j-over-slf4j\1.7.25\log4j-over-slf4j-1.7.25.jar;C:\Users\cycub\.m2\repository\org\apache\logging\log4j\log4j-slf4j-impl\2.6.1\log4j-slf4j-impl-
2.6.1.jar;C:\Users\cycub\.m2\repository\com\github\everit-org\json-schema\org.everit.json.schema\1.11.1\org.everit.json.schema-1.11.1.jar;C:\Users\cycub\.m2\repository\com\h2database\h2\1.4.199\h2-1.4.199.jar;C:\Users\cycub\.m2\repo
sitory\org\projectlombok\lombok\1.18.10\lombok-1.18.10.jar;C:\Users\cycub\.m2\repository\org\elasticsearch\elasticsearch-core\7.1.1\elasticsearch-core-7.1.1.jar;C:\Users\cycub\.m2\repository\org\elasticsearch\elasticsearch-secure-sm
\7.1.1\elasticsearch-secure-sm-7.1.1.jar;C:\Users\cycub\.m2\repository\org\elasticsearch\elasticsearch-x-content\7.1.1\elasticsearch-x-content-7.1.1.jar;C:\Users\cycub\.m2\repository\org\yaml\snakeyaml\1.17\snakeyaml-1.17.jar;C:\Use
rs\cycub\.m2\repository\com\fasterxml\jackson\core\jackson-core\2.8.11\jackson-core-2.8.11.jar;C:\Users\cycub\.m2\repository\com\fasterxml\jackson\dataformat\jackson-dataformat-smile\2.8.11\jackson-dataformat-smile-2.8.11.jar;C:\Use
rs\cycub\.m2\repository\com\fasterxml\jackson\dataformat\jackson-dataformat-yaml\2.8.11\jackson-dataformat-yaml-2.8.11.jar;C:\Users\cycub\.m2\repository\org\elasticsearch\elasticsearch-geo\7.1.1\elasticsearch-geo-7.1.1.jar;C:\Users\
cycub\.m2\repository\org\apache\lucene\lucene-core\8.0.0\lucene-core-8.0.0.jar;C:\Users\cycub\.m2\repository\org\apache\lucene\lucene-analyzers-common\8.0.0\lucene-analyzers-common-8.0.0.jar;C:\Users\cycub\.m2\repository\org\apache\
lucene\lucene-backward-codecs\8.0.0\lucene-backward-codecs-8.0.0.jar;C:\Users\cycub\.m2\repository\org\apache\lucene\lucene-grouping\8.0.0\lucene-grouping-8.0.0.jar;C:\Users\cycub\.m2\repository\org\apache\lucene\lucene-highlighter\
8.0.0\lucene-highlighter-8.0.0.jar;C:\Users\cycub\.m2\repository\org\apache\lucene\lucene-join\8.0.0\lucene-join-8.0.0.jar;C:\Users\cycub\.m2\repository\org\apache\lucene\lucene-memory\8.0.0\lucene-memory-8.0.0.jar;C:\Users\cycub\.m
2\repository\org\apache\lucene\lucene-misc\8.0.0\lucene-misc-8.0.0.jar;C:\Users\cycub\.m2\repository\org\apache\lucene\lucene-queries\8.0.0\lucene-queries-8.0.0.jar;C:\Users\cycub\.m2\repository\org\apache\lucene\lucene-queryparser\
8.0.0\lucene-queryparser-8.0.0.jar;C:\Users\cycub\.m2\repository\org\apache\lucene\lucene-sandbox\8.0.0\lucene-sandbox-8.0.0.jar;C:\Users\cycub\.m2\repository\org\apache\lucene\lucene-spatial\8.0.0\lucene-spatial-8.0.0.jar;C:\Users\
cycub\.m2\repository\org\apache\lucene\lucene-spatial-extras\8.0.0\lucene-spatial-extras-8.0.0.jar;C:\Users\cycub\.m2\repository\org\apache\lucene\lucene-spatial3d\8.0.0\lucene-spatial3d-8.0.0.jar;C:\Users\cycub\.m2\repository\org\a
pache\lucene\lucene-suggest\8.0.0\lucene-suggest-8.0.0.jar;C:\Users\cycub\.m2\repository\org\elasticsearch\elasticsearch-cli\7.1.1\elasticsearch-cli-7.1.1.jar;C:\Users\cycub\.m2\repository\net\sf\jopt-simple\jopt-simple\5.0.2\jopt-s
imple-5.0.2.jar;C:\Users\cycub\.m2\repository\com\carrotsearch\hppc\0.7.1\hppc-0.7.1.jar;C:\Users\cycub\.m2\repository\joda-time\joda-time\2.10.1\joda-time-2.10.1.jar;C:\Users\cycub\.m2\repository\com\tdunning\t-digest\3.2\t-digest-
3.2.jar;C:\Users\cycub\.m2\repository\org\hdrhistogram\HdrHistogram\2.1.9\HdrHistogram-2.1.9.jar;C:\Users\cycub\.m2\repository\org\elasticsearch\jna\4.5.1\jna-4.5.1.jar;C:\Users\cycub\.m2\repository\org\elasticsearch\client\elastics
earch-rest-client\7.1.1\elasticsearch-rest-client-7.1.1.jar;C:\Users\cycub\.m2\repository\org\apache\httpcomponents\httpcore\4.4.11\httpcore-4.4.11.jar;C:\Users\cycub\.m2\repository\org\apache\httpcomponents\httpasyncclient\4.1.4\ht
tpasyncclient-4.1.4.jar;C:\Users\cycub\.m2\repository\org\apache\httpcomponents\httpcore-nio\4.4.11\httpcore-nio-4.4.11.jar;C:\Users\cycub\.m2\repository\commons-codec\commons-codec\1.11\commons-codec-1.11.jar;C:\Users\cycub\.m2\rep
ository\org\elasticsearch\plugin\parent-join-client\7.1.1\parent-join-client-7.1.1.jar;C:\Users\cycub\.m2\repository\org\elasticsearch\plugin\aggs-matrix-stats-client\7.1.1\aggs-matrix-stats-client-7.1.1.jar;C:\Users\cycub\.m2\repos
itory\org\elasticsearch\plugin\rank-eval-client\7.1.1\rank-eval-client-7.1.1.jar;C:\Users\cycub\.m2\repository\org\elasticsearch\plugin\lang-mustache-client\7.1.1\lang-mustache-client-7.1.1.jar;C:\Users\cycub\.m2\repository\com\gith
ub\spullara\mustache\java\compiler\0.9.3\compiler-0.9.3.jar;C:\Users\cycub\.m2\repository\com\google\protobuf\protobuf-java\3.6.1\protobuf-java-3.6.1.jar;C:\Users\cycub\.m2\repository\junit\junit\4.10\junit-4.10.jar;C:\Users\cycub\.
m2\repository\org\hamcrest\hamcrest-core\1.1\hamcrest-core-1.1.jar;C:\Users\cycub\.m2\repository\commons-logging\commons-logging\1.1.3\commons-logging-1.1.3.jar;C:\Users\cycub\.m2\repository\org\apache\httpcomponents\httpclient\4.5.
2\httpclient-4.5.2.jar;C:\Users\cycub\.m2\repository\software\amazon\ion\ion-java\1.0.2\ion-java-1.0.2.jar;C:\Users\cycub\.m2\repository\com\fasterxml\jackson\core\jackson-databind\2.6.6\jackson-databind-2.6.6.jar;C:\Users\cycub\.m2
\repository\com\fasterxml\jackson\core\jackson-annotations\2.6.0\jackson-annotations-2.6.0.jar;C:\Users\cycub\.m2\repository\com\fasterxml\jackson\dataformat\jackson-dataformat-cbor\2.6.6\jackson-dataformat-cbor-2.6.6.jar;C:\Users\c
ycub\.m2\repository\com\amazonaws\jmespath-java\1.11.126\jmespath-java-1.11.126.jar;C:\Users\cycub\.m2\repository\com\amazonaws\aws-java-sdk-kms\1.11.126\aws-java-sdk-kms-1.11.126.jar;C:\Users\cycub\.m2\repository\com\google\guava\g
uava\14.0.1\guava-14.0.1.jar;C:\Users\cycub\.m2\repository\it\unimi\dsi\fastutil\7.0.12\fastutil-7.0.12.jar;C:\Users\cycub\.m2\repository\org\springframework\spring-aop\5.1.6.RELEASE\spring-aop-5.1.6.RELEASE.jar;C:\Users\cycub\.m2\r
epository\org\springframework\spring-beans\5.1.6.RELEASE\spring-beans-5.1.6.RELEASE.jar;C:\Users\cycub\.m2\repository\org\springframework\spring-core\5.1.6.RELEASE\spring-core-5.1.6.RELEASE.jar;C:\Users\cycub\.m2\repository\org\spri
ngframework\spring-jcl\5.1.6.RELEASE\spring-jcl-5.1.6.RELEASE.jar;C:\Users\cycub\.m2\repository\org\springframework\spring-expression\5.1.6.RELEASE\spring-expression-5.1.6.RELEASE.jar;C:\Users\cycub\.m2\repository\org\aspectj\aspect
jweaver\1.9.2\aspectjweaver-1.9.2.jar;C:\Users\cycub\.m2\repository\org\springframework\spring-tx\5.1.6.RELEASE\spring-tx-5.1.6.RELEASE.jar;C:\Users\cycub\.m2\repository\org\jboss\logging\jboss-logging\3.3.0.Final\jboss-logging-3.3.
0.Final.jar;C:\Users\cycub\.m2\repository\com\fasterxml\classmate\1.3.1\classmate-1.3.1.jar;C:\Users\cycub\.m2\repository\org\json\json\20180130\json-20180130.jar;C:\Users\cycub\.m2\repository\commons-validator\commons-validator\1.6
\commons-validator-1.6.jar;C:\Users\cycub\.m2\repository\commons-digester\commons-digester\1.8.1\commons-digester-1.8.1.jar;C:\Users\cycub\.m2\repository\commons-collections\commons-collections\3.2.2\commons-collections-3.2.2.jar;C:
\Users\cycub\.m2\repository\commons-beanutils\commons-beanutils\1.9.3\commons-beanutils-1.9.3.jar;C:\Users\cycub\.m2\repository\com\damnhandy\handy-uri-templates\2.1.6\handy-uri-templates-2.1.6.jar;C:\Users\cycub\.m2\repository\com\
google\re2j\re2j\1.1\re2j-1.1.jar;C:\Users\cycub\Documents\cybercube-am\cybercube\cat-analytical-engine\target\classes
        <unknown source file>:<no line information>

[WARNING] You aren't using a compiler supported by lombok, so lombok will not work and has been disabled.
Your processor is: org.aspectj.org.eclipse.jdt.internal.compiler.apt.dispatch.BatchProcessingEnvImpl
Lombok supports: sun/apple javac 1.6, ECJ
        <unknown source file>:<no line information>

[INFO]
[INFO] --- maven-resources-plugin:3.1.0:testResources (default-testResources) @ cat-analytical-engine ---
[WARNING] Using platform encoding (UTF8 actually) to copy filtered resources, i.e. build is platform dependent!
[INFO] Copying 3 resources
[INFO]
[INFO] --- maven-compiler-plugin:3.8.0:testCompile (default-testCompile) @ cat-analytical-engine ---
[INFO] Changes detected - recompiling the module!
[WARNING] File encoding has not been set, using platform encoding UTF8, i.e. build is platform dependent!
[INFO] Compiling 11 source files to C:\Users\cycub\Documents\cybercube-am\cybercube\cat-analytical-engine\target\test-classes
[INFO]
[INFO] --- maven-surefire-plugin:2.22.1:test (default-test) @ cat-analytical-engine ---
[INFO]
[INFO] -------------------------------------------------------
[INFO]  T E S T S
[INFO] -------------------------------------------------------
[INFO] Running com.cybercube.cat.financial.ExpressionEvaluatorV2Test
[INFO] Tests run: 1, Failures: 0, Errors: 0, Skipped: 0, Time elapsed: 8.654 s - in com.cybercube.cat.financial.ExpressionEvaluatorV2Test
[INFO] Running com.cybercube.cat.financial.SymantecInterpolationTest
[INFO] Tests run: 1, Failures: 0, Errors: 0, Skipped: 0, Time elapsed: 0.003 s - in com.cybercube.cat.financial.SymantecInterpolationTest
[INFO] Running com.cybercube.cat.model.CatPortfolioImportTest
[INFO] Tests run: 2, Failures: 0, Errors: 0, Skipped: 0, Time elapsed: 6.222 s - in com.cybercube.cat.model.CatPortfolioImportTest
[INFO] Running com.cybercube.cat.service.ExpressionEvaluatorTest
[INFO] Tests run: 2, Failures: 0, Errors: 0, Skipped: 0, Time elapsed: 0.004 s - in com.cybercube.cat.service.ExpressionEvaluatorTest
[INFO] Running com.cybercube.cat.service.SymLogNormalInverseTest
[INFO] Tests run: 4, Failures: 0, Errors: 0, Skipped: 0, Time elapsed: 0.003 s - in com.cybercube.cat.service.SymLogNormalInverseTest
[INFO] Running com.cybercube.cat.service.VersionHelperTest
[INFO] Tests run: 1, Failures: 0, Errors: 0, Skipped: 0, Time elapsed: 0.004 s - in com.cybercube.cat.service.VersionHelperTest
[INFO] Running com.cybercube.cat.simulation.SimRunTest
[WARNING] Tests run: 2, Failures: 0, Errors: 0, Skipped: 1, Time elapsed: 0.002 s - in com.cybercube.cat.simulation.SimRunTest
[INFO] Running com.cybercube.cat.util.AwsHelperTest
[WARNING] Tests run: 1, Failures: 0, Errors: 0, Skipped: 1, Time elapsed: 0.003 s - in com.cybercube.cat.util.AwsHelperTest
[INFO]
[INFO] Results:
[INFO]
[WARNING] Tests run: 14, Failures: 0, Errors: 0, Skipped: 2
[INFO]
[INFO]
[INFO] --- maven-resources-plugin:3.1.0:copy-resources (copy-resources-target) @ cat-analytical-engine ---
[WARNING] Using platform encoding (UTF8 actually) to copy filtered resources, i.e. build is platform dependent!
[INFO] Copying 3 resources
[INFO] Copying 1 resource
[INFO]
[INFO] --- maven-resources-plugin:3.1.0:copy-resources (copy-resources) @ cat-analytical-engine ---
[WARNING] File encoding has not been set, using platform encoding UTF8, i.e. build is platform dependent!
[WARNING] Please take a look into the FAQ: https://maven.apache.org/general.html#encoding-warning
[WARNING] Using platform encoding (UTF8 actually) to copy filtered resources, i.e. build is platform dependent!
[INFO] Copying 1 resource
[INFO] Copying 1 resource
[INFO]
[INFO] --- maven-jar-plugin:2.4:jar (default-jar) @ cat-analytical-engine ---
[INFO] Building jar: C:\Users\cycub\Documents\cybercube-am\cybercube\cat-analytical-engine\target\cat-analytical-engine-1.1.0.jar
[INFO]
[INFO] --- maven-shade-plugin:3.2.1:shade (default) @ cat-analytical-engine ---
[INFO] Including org.elasticsearch:elasticsearch:jar:7.1.1 in the shaded jar.
[INFO] Including org.elasticsearch:elasticsearch-core:jar:7.1.1 in the shaded jar.
[INFO] Including org.elasticsearch:elasticsearch-secure-sm:jar:7.1.1 in the shaded jar.
[INFO] Including org.elasticsearch:elasticsearch-x-content:jar:7.1.1 in the shaded jar.
[INFO] Including org.yaml:snakeyaml:jar:1.17 in the shaded jar.
[INFO] Including com.fasterxml.jackson.core:jackson-core:jar:2.8.11 in the shaded jar.
[INFO] Including com.fasterxml.jackson.dataformat:jackson-dataformat-smile:jar:2.8.11 in the shaded jar.
[INFO] Including com.fasterxml.jackson.dataformat:jackson-dataformat-yaml:jar:2.8.11 in the shaded jar.
[INFO] Including org.elasticsearch:elasticsearch-geo:jar:7.1.1 in the shaded jar.
[INFO] Including org.apache.lucene:lucene-core:jar:8.0.0 in the shaded jar.
[INFO] Including org.apache.lucene:lucene-analyzers-common:jar:8.0.0 in the shaded jar.
[INFO] Including org.apache.lucene:lucene-backward-codecs:jar:8.0.0 in the shaded jar.
[INFO] Including org.apache.lucene:lucene-grouping:jar:8.0.0 in the shaded jar.
[INFO] Including org.apache.lucene:lucene-highlighter:jar:8.0.0 in the shaded jar.
[INFO] Including org.apache.lucene:lucene-join:jar:8.0.0 in the shaded jar.
[INFO] Including org.apache.lucene:lucene-memory:jar:8.0.0 in the shaded jar.
[INFO] Including org.apache.lucene:lucene-misc:jar:8.0.0 in the shaded jar.
[INFO] Including org.apache.lucene:lucene-queries:jar:8.0.0 in the shaded jar.
[INFO] Including org.apache.lucene:lucene-queryparser:jar:8.0.0 in the shaded jar.
[INFO] Including org.apache.lucene:lucene-sandbox:jar:8.0.0 in the shaded jar.
[INFO] Including org.apache.lucene:lucene-spatial:jar:8.0.0 in the shaded jar.
[INFO] Including org.apache.lucene:lucene-spatial-extras:jar:8.0.0 in the shaded jar.
[INFO] Including org.apache.lucene:lucene-spatial3d:jar:8.0.0 in the shaded jar.
[INFO] Including org.apache.lucene:lucene-suggest:jar:8.0.0 in the shaded jar.
[INFO] Including org.elasticsearch:elasticsearch-cli:jar:7.1.1 in the shaded jar.
[INFO] Including net.sf.jopt-simple:jopt-simple:jar:5.0.2 in the shaded jar.
[INFO] Including com.carrotsearch:hppc:jar:0.7.1 in the shaded jar.
[INFO] Including joda-time:joda-time:jar:2.10.1 in the shaded jar.
[INFO] Including com.tdunning:t-digest:jar:3.2 in the shaded jar.
[INFO] Including org.hdrhistogram:HdrHistogram:jar:2.1.9 in the shaded jar.
[INFO] Including org.elasticsearch:jna:jar:4.5.1 in the shaded jar.
[INFO] Including org.elasticsearch.client:elasticsearch-rest-high-level-client:jar:7.1.1 in the shaded jar.
[INFO] Including org.elasticsearch.client:elasticsearch-rest-client:jar:7.1.1 in the shaded jar.
[INFO] Including org.apache.httpcomponents:httpcore:jar:4.4.11 in the shaded jar.
[INFO] Including org.apache.httpcomponents:httpasyncclient:jar:4.1.4 in the shaded jar.
[INFO] Including org.apache.httpcomponents:httpcore-nio:jar:4.4.11 in the shaded jar.
[INFO] Including commons-codec:commons-codec:jar:1.11 in the shaded jar.
[INFO] Including org.elasticsearch.plugin:parent-join-client:jar:7.1.1 in the shaded jar.
[INFO] Including org.elasticsearch.plugin:aggs-matrix-stats-client:jar:7.1.1 in the shaded jar.
[INFO] Including org.elasticsearch.plugin:rank-eval-client:jar:7.1.1 in the shaded jar.
[INFO] Including org.elasticsearch.plugin:lang-mustache-client:jar:7.1.1 in the shaded jar.
[INFO] Including com.github.spullara.mustache.java:compiler:jar:0.9.3 in the shaded jar.
[INFO] Including mysql:mysql-connector-java:jar:8.0.13 in the shaded jar.
[INFO] Including com.google.protobuf:protobuf-java:jar:3.6.1 in the shaded jar.
[INFO] Including org.slf4j:slf4j-api:jar:1.7.25 in the shaded jar.
[INFO] Including org.apache.commons:commons-math3:jar:3.6.1 in the shaded jar.
[INFO] Including org.apache.commons:commons-lang3:jar:3.8.1 in the shaded jar.
[INFO] Including com.googlecode.json-simple:json-simple:jar:1.1.1 in the shaded jar.
[INFO] Including junit:junit:jar:4.10 in the shaded jar.
[INFO] Including org.hamcrest:hamcrest-core:jar:1.1 in the shaded jar.
[INFO] Including com.amazonaws:aws-java-sdk-core:jar:1.11.126 in the shaded jar.
[INFO] Including commons-logging:commons-logging:jar:1.1.3 in the shaded jar.
[INFO] Including org.apache.httpcomponents:httpclient:jar:4.5.2 in the shaded jar.
[INFO] Including software.amazon.ion:ion-java:jar:1.0.2 in the shaded jar.
[INFO] Including com.fasterxml.jackson.core:jackson-databind:jar:2.6.6 in the shaded jar.
[INFO] Including com.fasterxml.jackson.core:jackson-annotations:jar:2.6.0 in the shaded jar.
[INFO] Including com.fasterxml.jackson.dataformat:jackson-dataformat-cbor:jar:2.6.6 in the shaded jar.
[INFO] Including com.amazonaws:aws-java-sdk-sqs:jar:1.11.126 in the shaded jar.
[INFO] Including com.amazonaws:jmespath-java:jar:1.11.126 in the shaded jar.
[INFO] Including com.amazonaws:aws-java-sdk-s3:jar:1.11.126 in the shaded jar.
[INFO] Including com.amazonaws:aws-java-sdk-kms:jar:1.11.126 in the shaded jar.
[INFO] Including com.amazonaws:aws-java-sdk-autoscaling:jar:1.11.126 in the shaded jar.
[INFO] Including commons-io:commons-io:jar:2.5 in the shaded jar.
[INFO] Including org.apache.mahout:mahout-math:jar:0.13.0 in the shaded jar.
[INFO] Including com.google.guava:guava:jar:14.0.1 in the shaded jar.
[INFO] Including it.unimi.dsi:fastutil:jar:7.0.12 in the shaded jar.
[INFO] Including org.springframework:spring-context:jar:5.1.6.RELEASE in the shaded jar.
[INFO] Including org.springframework:spring-aop:jar:5.1.6.RELEASE in the shaded jar.
[INFO] Including org.springframework:spring-beans:jar:5.1.6.RELEASE in the shaded jar.
[INFO] Including org.springframework:spring-core:jar:5.1.6.RELEASE in the shaded jar.
[INFO] Including org.springframework:spring-jcl:jar:5.1.6.RELEASE in the shaded jar.
[INFO] Including org.springframework:spring-expression:jar:5.1.6.RELEASE in the shaded jar.
[INFO] Including javax.validation:validation-api:jar:2.0.1.Final in the shaded jar.
[INFO] Including org.glassfish:javax.el:jar:3.0.1-b08 in the shaded jar.
[INFO] Including c3p0:c3p0:jar:0.9.1.2 in the shaded jar.
[INFO] Including org.springframework:spring-aspects:jar:5.1.6.RELEASE in the shaded jar.
[INFO] Including org.aspectj:aspectjweaver:jar:1.9.2 in the shaded jar.
[INFO] Including org.springframework:spring-jdbc:jar:5.1.6.RELEASE in the shaded jar.
[INFO] Including org.springframework:spring-tx:jar:5.1.6.RELEASE in the shaded jar.
[INFO] Including org.eclipse.jdt.core.compiler:ecj:jar:4.6.1 in the shaded jar.
[INFO] Including org.hibernate:hibernate-validator:jar:5.4.3.Final in the shaded jar.
[INFO] Including org.jboss.logging:jboss-logging:jar:3.3.0.Final in the shaded jar.
[INFO] Including com.fasterxml:classmate:jar:1.3.1 in the shaded jar.
[INFO] Including org.apache.logging.log4j:log4j-api:jar:2.6.1 in the shaded jar.
[INFO] Including org.apache.logging.log4j:log4j-core:jar:2.6.1 in the shaded jar.
[INFO] Including com.lmax:disruptor:jar:3.3.4 in the shaded jar.
[INFO] Including org.slf4j:jcl-over-slf4j:jar:1.7.25 in the shaded jar.
[INFO] Including org.slf4j:log4j-over-slf4j:jar:1.7.25 in the shaded jar.
[INFO] Including org.apache.logging.log4j:log4j-slf4j-impl:jar:2.6.1 in the shaded jar.
[INFO] Including com.github.everit-org.json-schema:org.everit.json.schema:jar:1.11.1 in the shaded jar.
[INFO] Including org.json:json:jar:20180130 in the shaded jar.
[INFO] Including commons-validator:commons-validator:jar:1.6 in the shaded jar.
[INFO] Including commons-digester:commons-digester:jar:1.8.1 in the shaded jar.
[INFO] Including commons-collections:commons-collections:jar:3.2.2 in the shaded jar.
[INFO] Including commons-beanutils:commons-beanutils:jar:1.9.3 in the shaded jar.
[INFO] Including com.damnhandy:handy-uri-templates:jar:2.1.6 in the shaded jar.
[INFO] Including com.google.re2j:re2j:jar:1.1 in the shaded jar.
[INFO] Including org.projectlombok:lombok:jar:1.18.10 in the shaded jar.
[WARNING] Discovered module-info.class. Shading will break its strong encapsulation.
[WARNING] jcl-over-slf4j-1.7.25.jar, spring-jcl-5.1.6.RELEASE.jar, commons-logging-1.1.3.jar define 4 overlapping classes:
[WARNING]   - org.apache.commons.logging.Log
[WARNING]   - org.apache.commons.logging.impl.SimpleLog
[WARNING]   - org.apache.commons.logging.impl.NoOpLog
[WARNING]   - org.apache.commons.logging.LogFactory
[WARNING] junit-4.10.jar, hamcrest-core-1.1.jar define 21 overlapping classes:
[WARNING]   - org.hamcrest.Description
[WARNING]   - org.hamcrest.internal.SelfDescribingValue
[WARNING]   - org.hamcrest.CoreMatchers
[WARNING]   - org.hamcrest.core.AllOf
[WARNING]   - org.hamcrest.SelfDescribing
[WARNING]   - org.hamcrest.core.IsSame
[WARNING]   - org.hamcrest.BaseDescription
[WARNING]   - org.hamcrest.core.DescribedAs
[WARNING]   - org.hamcrest.Factory
[WARNING]   - org.hamcrest.internal.ArrayIterator
[WARNING]   - 11 more...
[WARNING] spring-jcl-5.1.6.RELEASE.jar, commons-logging-1.1.3.jar define 1 overlapping classes:
[WARNING]   - org.apache.commons.logging.LogFactory$1
[WARNING] jcl-over-slf4j-1.7.25.jar, commons-logging-1.1.3.jar define 2 overlapping classes:
[WARNING]   - org.apache.commons.logging.impl.SimpleLog$1
[WARNING]   - org.apache.commons.logging.LogConfigurationException
[WARNING] maven-shade-plugin has detected that some class files are
[WARNING] present in two or more JARs. When this happens, only one
[WARNING] single version of the class is copied to the uber jar.
[WARNING] Usually this is not harmful and you can skip these warnings,
[WARNING] otherwise try to manually exclude artifacts based on
[WARNING] mvn dependency:tree -Ddetail=true and the above output.
[WARNING] See http://maven.apache.org/plugins/maven-shade-plugin/
[INFO] Attaching shaded artifact.
[INFO]
[INFO] --- maven-install-plugin:2.4:install (default-install) @ cat-analytical-engine ---
[INFO] Installing C:\Users\cycub\Documents\cybercube-am\cybercube\cat-analytical-engine\target\cat-analytical-engine-1.1.0.jar to C:\Users\cycub\.m2\repository\com\cybercube\cat-analytical-engine\1.1.0\cat-analytical-engine-1.1.0.ja
r
[INFO] Installing C:\Users\cycub\Documents\cybercube-am\cybercube\cat-analytical-engine\pom.xml to C:\Users\cycub\.m2\repository\com\cybercube\cat-analytical-engine\1.1.0\cat-analytical-engine-1.1.0.pom
[INFO] Installing C:\Users\cycub\Documents\cybercube-am\cybercube\cat-analytical-engine\target\cat-analytical-engine-1.1.0-executable.jar to C:\Users\cycub\.m2\repository\com\cybercube\cat-analytical-engine\1.1.0\cat-analytical-engi
ne-1.1.0-executable.jar
[INFO]
[INFO] ------------------< com.cybercube:risk-score-engine >-------------------
[INFO] Building risk-score-engine 1.0.0                                   [3/7]
[INFO] --------------------------------[ jar ]---------------------------------
[INFO]
[INFO] --- maven-clean-plugin:2.5:clean (default-clean) @ risk-score-engine ---
[INFO] Deleting C:\Users\cycub\Documents\cybercube-am\cybercube\risk-score-engine\target
[INFO]
[INFO] --- jacoco-maven-plugin:0.8.3:prepare-agent (prepare-agent) @ risk-score-engine ---
[INFO] argLine set to -javaagent:C:\\Users\\cycub\\.m2\\repository\\org\\jacoco\\org.jacoco.agent\\0.8.3\\org.jacoco.agent-0.8.3-runtime.jar=destfile=C:\\Users\\cycub\\Documents\\cybercube-am\\cybercube\\risk-score-engine\\target\\j
acoco.exec
[INFO]
[INFO] --- maven-resources-plugin:2.6:resources (default-resources) @ risk-score-engine ---
[WARNING] Using platform encoding (UTF8 actually) to copy filtered resources, i.e. build is platform dependent!
[INFO] Copying 4 resources
[INFO]
[INFO] --- maven-compiler-plugin:3.1:compile (default-compile) @ risk-score-engine ---
[INFO] Changes detected - recompiling the module!
[WARNING] File encoding has not been set, using platform encoding UTF8, i.e. build is platform dependent!
[INFO] Compiling 109 source files to C:\Users\cycub\Documents\cybercube-am\cybercube\risk-score-engine\target\classes
[WARNING] /C:/Users/cycub/Documents/cybercube-am/cybercube/risk-score-engine/src/main/java/com/cybercube/rs/scoring/core/helper/ScoreAttributeHolder.java: Some input files use unchecked or unsafe operations.
[WARNING] /C:/Users/cycub/Documents/cybercube-am/cybercube/risk-score-engine/src/main/java/com/cybercube/rs/scoring/core/helper/ScoreAttributeHolder.java: Recompile with -Xlint:unchecked for details.
[INFO]
[INFO] --- maven-resources-plugin:2.6:testResources (default-testResources) @ risk-score-engine ---
[WARNING] Using platform encoding (UTF8 actually) to copy filtered resources, i.e. build is platform dependent!
[INFO] Copying 23 resources
[INFO]
[INFO] --- maven-compiler-plugin:3.1:testCompile (default-testCompile) @ risk-score-engine ---
[INFO] Changes detected - recompiling the module!
[WARNING] File encoding has not been set, using platform encoding UTF8, i.e. build is platform dependent!
[INFO] Compiling 23 source files to C:\Users\cycub\Documents\cybercube-am\cybercube\risk-score-engine\target\test-classes
[WARNING] /C:/Users/cycub/Documents/cybercube-am/cybercube/risk-score-engine/src/test/java/com/cybercube/rs/scoring/internalData/caching/ScoreSegmentFilterTest.java: Some input files use or override a deprecated API.
[WARNING] /C:/Users/cycub/Documents/cybercube-am/cybercube/risk-score-engine/src/test/java/com/cybercube/rs/scoring/internalData/caching/ScoreSegmentFilterTest.java: Recompile with -Xlint:deprecation for details.
[WARNING] /C:/Users/cycub/Documents/cybercube-am/cybercube/risk-score-engine/src/test/java/com/cybercube/rs/scoring/internalData/caching/ScoreRankCacheTest.java: C:\Users\cycub\Documents\cybercube-am\cybercube\risk-score-engine\src\
test\java\com\cybercube\rs\scoring\internalData\caching\ScoreRankCacheTest.java uses unchecked or unsafe operations.
[WARNING] /C:/Users/cycub/Documents/cybercube-am/cybercube/risk-score-engine/src/test/java/com/cybercube/rs/scoring/internalData/caching/ScoreRankCacheTest.java: Recompile with -Xlint:unchecked for details.
[INFO]
[INFO] --- maven-surefire-plugin:2.22.1:test (default-test) @ risk-score-engine ---
[INFO]
[INFO] -------------------------------------------------------
[INFO]  T E S T S
[INFO] -------------------------------------------------------
[INFO] Running com.cybercube.rs.scoring.core.helper.ScoreAttributeHolderTest
[INFO] Tests run: 2, Failures: 0, Errors: 0, Skipped: 0, Time elapsed: 0.252 s - in com.cybercube.rs.scoring.core.helper.ScoreAttributeHolderTest
[INFO] Running com.cybercube.rs.scoring.internalData.caching.ControlsCacheTest
2020-03-29 21:30:53.943  INFO   --- [           main] c.c.rs.config.EnvironmentAttributes      : Instantiating Risk Scoring Engine Environment Attributes
2020-03-29 21:30:54.606  INFO   --- [           main] c.c.r.s.e.caching.SSCIndustryCache       : Reading SSC Industry table
2020-03-29 21:30:55.016  INFO   --- [           main] c.c.r.s.e.caching.SSCIndustryCache       : SSC Industry stats are loaded
2020-03-29 21:30:55.055  INFO   --- [           main] c.c.r.s.externalData.caching.SSCMSCache  : Reading SSC MicroSegment table
2020-03-29 21:30:55.133  INFO   --- [           main] c.c.r.s.externalData.caching.SSCMSCache  : SSC MicroSegment segment stats are loaded
2020-03-29 21:30:55.274  INFO   --- [           main] c.c.r.s.e.caching.SSCPercentilesCache    : Start reading::SSC Percentiles
2020-03-29 21:30:55.324  INFO   --- [           main] c.c.r.s.e.caching.SSCPercentilesCache    : End reading::SSC Percentiles
2020-03-29 21:30:55.359  INFO   --- [           main] c.c.r.s.e.caching.SSCRegionCache         : Reading SSC Region table
2020-03-29 21:30:55.394  INFO   --- [           main] c.c.r.s.e.caching.SSCRegionCache         : SSC Region segment stats are loaded
2020-03-29 21:30:55.437  INFO   --- [           main] c.c.r.s.e.caching.SSCSizeCache           : Reading SSC Size table
2020-03-29 21:30:55.469  INFO   --- [           main] c.c.r.s.e.caching.SSCSizeCache           : SSC Size segment stats are loaded
2020-03-29 21:30:55.527  INFO   --- [           main] c.c.r.s.i.caching.ControlsCache          : Reading Controls table
2020-03-29 21:30:55.544  INFO   --- [           main] c.c.r.s.i.caching.ControlsCache          : Controls are loaded
2020-03-29 21:30:55.779  INFO   --- [           main] c.c.r.s.i.c.ExposurePercentilesCache     : Start reading::exposurePercentiles
2020-03-29 21:30:55.861  INFO   --- [           main] c.c.r.s.i.c.ExposurePercentilesCache     : End reading::exposurePercentiles
2020-03-29 21:30:55.889  INFO   --- [           main] c.c.r.s.i.c.ExposureVariablesCache       : Start reading::ExposureVariableScores
2020-03-29 21:30:55.920  INFO   --- [           main] c.c.r.s.i.c.ExposureVariablesCache       : End reading::ExposureVariableScores
2020-03-29 21:30:56.054  INFO   --- [           main] c.c.r.s.i.caching.GeoRefCache            : Start reading::geoRefRepository
2020-03-29 21:30:56.071  INFO   --- [           main] c.c.r.s.i.caching.GeoRefCache            : End reading::geoRefRepository
2020-03-29 21:30:56.073  INFO   --- [           main] c.c.r.s.i.caching.GeoRefCache            : End load Data from geoRefRepository
2020-03-29 21:30:56.102  INFO   --- [           main] c.c.r.s.i.caching.IndustryCache          : Reading Symc Industry table
2020-03-29 21:30:56.191  INFO   --- [           main] c.c.r.s.i.caching.IndustryCache          : Symc Industry stats are loaded
2020-03-29 21:30:56.220  INFO   --- [           main] c.c.r.s.internalData.caching.MSCache     : Reading Symc MicroSegment table
2020-03-29 21:30:56.257  INFO   --- [           main] c.c.r.s.internalData.caching.MSCache     : Symc MicroSegment segment stats are loaded
2020-03-29 21:30:56.295  INFO   --- [           main] c.c.r.s.i.caching.RefValuesCache         : Loading refValues
2020-03-29 21:30:56.407  INFO   --- [           main] c.c.r.s.i.caching.RefValuesCache         : Ref values are loaded
2020-03-29 21:30:56.436  INFO   --- [           main] c.c.r.s.i.caching.RegionCache            : Reading Symc Region table
2020-03-29 21:30:56.455  INFO   --- [           main] c.c.r.s.i.caching.RegionCache            : Symc Region segment stats are loaded
2020-03-29 21:30:56.537  INFO   --- [           main] c.c.r.s.i.caching.ScoreRankCache         : Start reading::securityRank & exposureRank
2020-03-29 21:30:56.872  INFO   --- [           main] c.c.r.s.i.caching.ScoreRankCache         : End reading::securityRank & exposureRank
2020-03-29 21:30:56.898  INFO   --- [           main] c.c.r.s.internalData.caching.SizeCache   : Reading Symc Size table
2020-03-29 21:30:56.944  INFO   --- [           main] c.c.r.s.internalData.caching.SizeCache   : Symc Size segment stats are loaded
2020-03-29 21:30:56.990  INFO   --- [           main] c.c.r.s.i.caching.ControlsCache          : Reading symcCompanySizes table
2020-03-29 21:30:57.013  INFO   --- [           main] c.c.r.s.i.caching.ControlsCache          : SymcCompanySizes are loaded
[INFO] Tests run: 2, Failures: 0, Errors: 0, Skipped: 0, Time elapsed: 14.103 s - in com.cybercube.rs.scoring.internalData.caching.ControlsCacheTest
[INFO] Running com.cybercube.rs.scoring.internalData.caching.ExposurePercentilesCacheTest
[INFO] Tests run: 2, Failures: 0, Errors: 0, Skipped: 0, Time elapsed: 0.01 s - in com.cybercube.rs.scoring.internalData.caching.ExposurePercentilesCacheTest
[INFO] Running com.cybercube.rs.scoring.internalData.caching.ExposureVariablesCacheTest
[INFO] Tests run: 2, Failures: 0, Errors: 0, Skipped: 0, Time elapsed: 0.006 s - in com.cybercube.rs.scoring.internalData.caching.ExposureVariablesCacheTest
[INFO] Running com.cybercube.rs.scoring.internalData.caching.GeoRefCacheTest
[INFO] Tests run: 2, Failures: 0, Errors: 0, Skipped: 0, Time elapsed: 0.022 s - in com.cybercube.rs.scoring.internalData.caching.GeoRefCacheTest
[INFO] Running com.cybercube.rs.scoring.internalData.caching.IndustryCacheTest
[INFO] Tests run: 2, Failures: 0, Errors: 0, Skipped: 0, Time elapsed: 0.027 s - in com.cybercube.rs.scoring.internalData.caching.IndustryCacheTest
[INFO] Running com.cybercube.rs.scoring.internalData.caching.MSCacheTest
[INFO] Tests run: 2, Failures: 0, Errors: 0, Skipped: 0, Time elapsed: 0.01 s - in com.cybercube.rs.scoring.internalData.caching.MSCacheTest
[INFO] Running com.cybercube.rs.scoring.internalData.caching.RegionCacheTest
[INFO] Tests run: 2, Failures: 0, Errors: 0, Skipped: 0, Time elapsed: 0.005 s - in com.cybercube.rs.scoring.internalData.caching.RegionCacheTest
[INFO] Running com.cybercube.rs.scoring.internalData.caching.ScoreRankCacheTest
[INFO] Tests run: 4, Failures: 0, Errors: 0, Skipped: 0, Time elapsed: 0.063 s - in com.cybercube.rs.scoring.internalData.caching.ScoreRankCacheTest
[INFO] Running com.cybercube.rs.scoring.internalData.caching.ScoreSegmentFilterBuilderTest
[INFO] Tests run: 1, Failures: 0, Errors: 0, Skipped: 0, Time elapsed: 0.004 s - in com.cybercube.rs.scoring.internalData.caching.ScoreSegmentFilterBuilderTest
[INFO] Running com.cybercube.rs.scoring.internalData.caching.ScoreSegmentFilterTest
[INFO] Tests run: 1, Failures: 0, Errors: 0, Skipped: 0, Time elapsed: 0.021 s - in com.cybercube.rs.scoring.internalData.caching.ScoreSegmentFilterTest
[INFO] Running com.cybercube.rs.scoring.internalData.caching.SizeCacheTest
[INFO] Tests run: 2, Failures: 0, Errors: 0, Skipped: 0, Time elapsed: 0.011 s - in com.cybercube.rs.scoring.internalData.caching.SizeCacheTest
[INFO] Running com.cybercube.rs.scoring.internalData.caching.SSCPercentilesCacheTest
[INFO] Tests run: 2, Failures: 0, Errors: 0, Skipped: 0, Time elapsed: 0.057 s - in com.cybercube.rs.scoring.internalData.caching.SSCPercentilesCacheTest
[INFO] Running com.cybercube.rs.scoring.internalData.caching.SymcCompanySizeCacheTest
[INFO] Tests run: 2, Failures: 0, Errors: 0, Skipped: 0, Time elapsed: 0.059 s - in com.cybercube.rs.scoring.internalData.caching.SymcCompanySizeCacheTest
[INFO] Running com.cybercube.rs.services.ExternalScoringAnalysisServiceTest
2020-03-29 21:30:59.201  INFO   --- [           main] c.c.r.s.ExternalScoringAnalysisService   : Get external scoring analysis for IQ20765463, 7370, US, Large, 201806
[ERROR] Tests run: 2, Failures: 0, Errors: 1, Skipped: 0, Time elapsed: 0.257 s <<< FAILURE! - in com.cybercube.rs.services.ExternalScoringAnalysisServiceTest
[ERROR] should_get_new_external_scoring_analysis  Time elapsed: 0.238 s  <<< ERROR!
com.cybercube.rs.exceptions.ScoringResultNotFound: Scoring result not found for timePoint 201806
        at com.cybercube.rs.services.ExternalScoringAnalysisServiceTest.should_get_new_external_scoring_analysis(ExternalScoringAnalysisServiceTest.java:34)

[INFO] Running com.cybercube.rs.services.ScoringAnalysisJDBCTemplateHandlerTest
[INFO] Tests run: 3, Failures: 0, Errors: 0, Skipped: 0, Time elapsed: 0.108 s - in com.cybercube.rs.services.ScoringAnalysisJDBCTemplateHandlerTest
[INFO] Running com.cybercube.rs.services.ScoringAnalysisServiceTest
[ERROR] Tests run: 14, Failures: 0, Errors: 11, Skipped: 1, Time elapsed: 0.697 s <<< FAILURE! - in com.cybercube.rs.services.ScoringAnalysisServiceTest
[ERROR] should_contain_scoring_analysis_mandatory_attributes_in_debug_mode  Time elapsed: 0.027 s  <<< ERROR!
com.cybercube.rs.exceptions.ScoringResultNotFound: Scoring result not found for timePoint 201806
        at com.cybercube.rs.services.ScoringAnalysisServiceTest.should_contain_scoring_analysis_mandatory_attributes_in_debug_mode(ScoringAnalysisServiceTest.java:181)

[ERROR] should_store_and_retrieve_a_new_scoring_analysis_with_scoring_results_without_debug_mode  Time elapsed: 0.152 s  <<< ERROR!
com.cybercube.rs.exceptions.ScoringResultNotFound: Scoring result not found for timePoint 201806
        at com.cybercube.rs.services.ScoringAnalysisServiceTest.should_store_and_retrieve_a_new_scoring_analysis_with_scoring_results_without_debug_mode(ScoringAnalysisServiceTest.java:269)

[ERROR] should_contain_scoring_analysis_mandatory_attributes_without_revenue  Time elapsed: 0.018 s  <<< ERROR!
com.cybercube.rs.exceptions.ScoringResultNotFound: Scoring result not found for timePoint 201806
        at com.cybercube.rs.services.ScoringAnalysisServiceTest.should_contain_scoring_analysis_mandatory_attributes_without_revenue(ScoringAnalysisServiceTest.java:161)

[ERROR] retrieve_a_new_one_month_scoring_analysis  Time elapsed: 0.122 s  <<< ERROR!
com.cybercube.rs.exceptions.ScoringResultNotFound: Scoring result not found for timePoint 201806
        at com.cybercube.rs.services.ScoringAnalysisServiceTest.retrieve_a_new_one_month_scoring_analysis(ScoringAnalysisServiceTest.java:397)

[ERROR] should_work_with_DN_company  Time elapsed: 0.018 s  <<< ERROR!
com.cybercube.rs.exceptions.ScoringResultNotFound: Scoring result not found for timePoint 201806
        at com.cybercube.rs.services.ScoringAnalysisServiceTest.should_work_with_DN_company(ScoringAnalysisServiceTest.java:249)

[ERROR] should_contain_one_month_scoring_results_mandatory_attributes  Time elapsed: 0.016 s  <<< ERROR!
com.cybercube.rs.exceptions.ScoringResultNotFound: Scoring result not found for timePoint 201806
        at com.cybercube.rs.services.ScoringAnalysisServiceTest.should_contain_one_month_scoring_results_mandatory_attributes(ScoringAnalysisServiceTest.java:419)

[ERROR] should_contain_scoring_results_mandatory_attributes  Time elapsed: 0.015 s  <<< ERROR!
com.cybercube.rs.exceptions.ScoringResultNotFound: Scoring result not found for timePoint 201806
        at com.cybercube.rs.services.ScoringAnalysisServiceTest.should_contain_scoring_results_mandatory_attributes(ScoringAnalysisServiceTest.java:291)

[ERROR] should_store_and_retrieve_a_new_scoring_analysis_with_scoring_results_on_debug_mode  Time elapsed: 0.118 s  <<< ERROR!
com.cybercube.rs.exceptions.ScoringResultNotFound: Scoring result not found for timePoint 201806
        at com.cybercube.rs.services.ScoringAnalysisServiceTest.should_store_and_retrieve_a_new_scoring_analysis_with_scoring_results_on_debug_mode(ScoringAnalysisServiceTest.java:213)

[ERROR] should_retrieve_API_V1_valid_data  Time elapsed: 0.013 s  <<< ERROR!
com.cybercube.rs.exceptions.ScoringResultNotFound: Scoring result not found for timePoint 201806
        at com.cybercube.rs.services.ScoringAnalysisServiceTest.should_retrieve_API_V1_valid_data(ScoringAnalysisServiceTest.java:313)

[ERROR] should_contain_scoring_analysis_mandatory_attributes  Time elapsed: 0.013 s  <<< ERROR!
com.cybercube.rs.exceptions.ScoringResultNotFound: Scoring result not found for timePoint 201806
        at com.cybercube.rs.services.ScoringAnalysisServiceTest.should_contain_scoring_analysis_mandatory_attributes(ScoringAnalysisServiceTest.java:138)

[ERROR] should_retrieve_API_V2_valid_data  Time elapsed: 0.018 s  <<< ERROR!
com.cybercube.rs.exceptions.ScoringResultNotFound: Scoring result not found for timePoint 201806
        at com.cybercube.rs.services.ScoringAnalysisServiceTest.should_retrieve_API_V2_valid_data(ScoringAnalysisServiceTest.java:333)

[INFO] Running com.cybercube.rs.services.ScoringAnalysisServiceUtilsTest
[WARNING] Tests run: 28, Failures: 0, Errors: 0, Skipped: 1, Time elapsed: 0.005 s - in com.cybercube.rs.services.ScoringAnalysisServiceUtilsTest
[INFO] Running com.cybercube.rs.services.withoutContext.ScoringAnalysisServiceUtilsTest
[INFO] Tests run: 5, Failures: 0, Errors: 0, Skipped: 0, Time elapsed: 0.16 s - in com.cybercube.rs.services.withoutContext.ScoringAnalysisServiceUtilsTest
[INFO]
[INFO] Results:
[INFO]
[ERROR] Errors: 
[ERROR]   ExternalScoringAnalysisServiceTest.should_get_new_external_scoring_analysis:34 » ScoringResultNotFound
[ERROR]   ScoringAnalysisServiceTest.retrieve_a_new_one_month_scoring_analysis:397 » ScoringResultNotFound
[ERROR]   ScoringAnalysisServiceTest.should_contain_one_month_scoring_results_mandatory_attributes:419 » ScoringResultNotFound
[ERROR]   ScoringAnalysisServiceTest.should_contain_scoring_analysis_mandatory_attributes:138 » ScoringResultNotFound
[ERROR]   ScoringAnalysisServiceTest.should_contain_scoring_analysis_mandatory_attributes_in_debug_mode:181 » ScoringResultNotFound
[ERROR]   ScoringAnalysisServiceTest.should_contain_scoring_analysis_mandatory_attributes_without_revenue:161 » ScoringResultNotFound
[ERROR]   ScoringAnalysisServiceTest.should_contain_scoring_results_mandatory_attributes:291 » ScoringResultNotFound
[ERROR]   ScoringAnalysisServiceTest.should_retrieve_API_V1_valid_data:313 » ScoringResultNotFound
[ERROR]   ScoringAnalysisServiceTest.should_retrieve_API_V2_valid_data:333 » ScoringResultNotFound
[ERROR]   ScoringAnalysisServiceTest.should_store_and_retrieve_a_new_scoring_analysis_with_scoring_results_on_debug_mode:213 » ScoringResultNotFound
[ERROR]   ScoringAnalysisServiceTest.should_store_and_retrieve_a_new_scoring_analysis_with_scoring_results_without_debug_mode:269 » ScoringResultNotFound
[ERROR]   ScoringAnalysisServiceTest.should_work_with_DN_company:249 » ScoringResultNotFound
[INFO]
[ERROR] Tests run: 80, Failures: 0, Errors: 12, Skipped: 2
[INFO]
[INFO] ------------------------------------------------------------------------
[INFO] Reactor Summary:
[INFO]
[INFO] cybercube 1.14.0 ................................... SUCCESS [  0.777 s]
[INFO] cat-analytical-engine 1.1.0 ........................ SUCCESS [ 47.410 s]
[INFO] risk-score-engine 1.0.0 ............................ FAILURE [ 28.631 s]
[INFO] user-service 1.0.0 ................................. SKIPPED
[INFO] client-web 1.14.0 .................................. SKIPPED
[INFO] Aggregate Report 1.14.0 ............................ SKIPPED
[INFO] solr 1.5.0 ......................................... SKIPPED
[INFO] ------------------------------------------------------------------------
[INFO] BUILD FAILURE
[INFO] ------------------------------------------------------------------------
[INFO] Total time:  01:17 min
[INFO] Finished at: 2020-03-29T21:31:02+03:00
[INFO] ------------------------------------------------------------------------
[ERROR] Failed to execute goal org.apache.maven.plugins:maven-surefire-plugin:2.22.1:test (default-test) on project risk-score-engine: There are test failures.
[ERROR]
[ERROR] Please refer to C:\Users\cycub\Documents\cybercube-am\cybercube\risk-score-engine\target\surefire-reports for the individual test results.
[ERROR] Please refer to dump files (if any exist) [date].dump, [date]-jvmRun[N].dump and [date].dumpstream.
[ERROR] -> [Help 1]
[ERROR]
[ERROR] To see the full stack trace of the errors, re-run Maven with the -e switch.
[ERROR] Re-run Maven using the -X switch to enable full debug logging.
[ERROR]
[ERROR] For more information about the errors and possible solutions, please read the following articles:
[ERROR] [Help 1] http://cwiki.apache.org/confluence/display/MAVEN/MojoFailureException
[ERROR]
[ERROR] After correcting the problems, you can resume the build with the command
[ERROR]   mvn <args> -rf :risk-score-engine

C:\Users\cycub\Documents\cybercube-am\cybercube>
close fullscreen
Login or Register to edit or fork this paste. It's free.